Target
Voltage-dependent T-type calcium channel subunit alpha-1G
Ligand
BDBM50200893
Substrate
Meas. Tech.
ChEMBL_1622851 (CHEMBL3865203)
IC50
17.0±n/a nM
Citation
 Siegrist, RPozzi, DJacob, GTorrisi, CColas, KBraibant, BMawet, JPfeifer, Tde Kanter, RRoch, CKessler, MCorminboeuf, OBezençon, O Structure-Activity Relationship, Drug Metabolism and Pharmacokinetics Properties Optimization, and in Vivo Studies of New Brain Penetrant Triple T-Type Calcium Channel Blockers. J Med Chem 59:10661-10675 (2016)  
Target
Name:
Voltage-dependent T-type calcium channel subunit alpha-1G
Synonyms:
CAC1G_HUMAN KIAA1123 Voltage-gated T-type calcium channel alpha-1G subunit
Type:
PROTEIN
Mol. Mass.:
262471.14
Organism:
Homo sapiens (Human)
Description:
ChEMBL_1515216
Residue:
2377
  
Inhibitor
Name:
BDBM50200893
Synonyms:
CHEMBL3913893
Type:
Small organic molecule
Emp. Form.:
C26H29N3O
Mol. Mass.:
399.528
SMILES:
C[C@@H]1CN(Cc2ccccc2)c2ccccc2[C@H](C)N1C(=O)NCc1ccccc1
: