Target
Voltage-dependent T-type calcium channel subunit alpha-1I
Ligand
BDBM50200787
Substrate
Meas. Tech.
ChEMBL_1622853 (CHEMBL3865205)
IC50
4.0±n/a nM
Citation
 Siegrist, RPozzi, DJacob, GTorrisi, CColas, KBraibant, BMawet, JPfeifer, Tde Kanter, RRoch, CKessler, MCorminboeuf, OBezençon, O Structure-Activity Relationship, Drug Metabolism and Pharmacokinetics Properties Optimization, and in Vivo Studies of New Brain Penetrant Triple T-Type Calcium Channel Blockers. J Med Chem 59:10661-10675 (2016)  
Target
Name:
Voltage-dependent T-type calcium channel subunit alpha-1I
Synonyms:
CAC1I_HUMAN KIAA1120 Voltage-gated T-type calcium channel alpha-1I subunit
Type:
PROTEIN
Mol. Mass.:
245101.25
Organism:
Homo sapiens (Human)
Description:
ChEMBL_538845
Residue:
2223
  
Inhibitor
Name:
BDBM50200787
Synonyms:
CHEMBL3906199
Type:
Small organic molecule
Emp. Form.:
C26H27F2N3O
Mol. Mass.:
435.5089
SMILES:
C[C@@H]1CN(Cc2cccc(F)c2F)c2ccccc2[C@H](C)N1C(=O)NCc1ccccc1
: