Target
Voltage-dependent T-type calcium channel subunit alpha-1I
Ligand
BDBM50200902
Substrate
Meas. Tech.
ChEMBL_1622853 (CHEMBL3865205)
IC50
12±n/a nM
Citation
 Siegrist, RPozzi, DJacob, GTorrisi, CColas, KBraibant, BMawet, JPfeifer, Tde Kanter, RRoch, CKessler, MCorminboeuf, OBezençon, O Structure-Activity Relationship, Drug Metabolism and Pharmacokinetics Properties Optimization, and in Vivo Studies of New Brain Penetrant Triple T-Type Calcium Channel Blockers. J Med Chem 59:10661-10675 (2016)  
Target
Name:
Voltage-dependent T-type calcium channel subunit alpha-1I
Synonyms:
CAC1I_HUMAN KIAA1120 Voltage-gated T-type calcium channel alpha-1I subunit
Type:
PROTEIN
Mol. Mass.:
245101.25
Organism:
Homo sapiens (Human)
Description:
ChEMBL_538845
Residue:
2223
  
Inhibitor
Name:
BDBM50200902
Synonyms:
CHEMBL3939715
Type:
Small organic molecule
Emp. Form.:
C25H35N3O2
Mol. Mass.:
409.5643
SMILES:
C[C@@H]1CN(CCOC(C)(C)C)c2ccccc2[C@H](C)N1C(=O)NCc1ccccc1
: