Target
Voltage-dependent T-type calcium channel subunit alpha-1G
Ligand
BDBM50192668
Substrate
Meas. Tech.
ChEMBL_1622837 (CHEMBL3865189)
IC50
1.2±n/a nM
Citation
 Siegrist, RPozzi, DJacob, GTorrisi, CColas, KBraibant, BMawet, JPfeifer, Tde Kanter, RRoch, CKessler, MCorminboeuf, OBezençon, O Structure-Activity Relationship, Drug Metabolism and Pharmacokinetics Properties Optimization, and in Vivo Studies of New Brain Penetrant Triple T-Type Calcium Channel Blockers. J Med Chem 59:10661-10675 (2016)  
Target
Name:
Voltage-dependent T-type calcium channel subunit alpha-1G
Synonyms:
CAC1G_HUMAN KIAA1123 Voltage-gated T-type calcium channel alpha-1G subunit
Type:
PROTEIN
Mol. Mass.:
262471.14
Organism:
Homo sapiens (Human)
Description:
ChEMBL_1515216
Residue:
2377
  
Inhibitor
Name:
BDBM50192668
Synonyms:
CHEMBL1684950
Type:
Small organic molecule
Emp. Form.:
C20H23F3N2O2
Mol. Mass.:
380.404
SMILES:
CC(C)c1ccc(CC(=O)N[C@H](C)c2ccc(OCC(F)(F)F)cn2)cc1
: