Target
C-C chemokine receptor type 3
Ligand
BDBM50202469
Substrate
Meas. Tech.
ChEMBL_1624212 (CHEMBL3866624)
EC50
1600±n/a nM
Citation
 Morikawa, THachiman, IMatsuo, KNishida, ENinomiya, KHayakawa, TYoshie, OMuraoka, ONakayama, T Neolignans from the Arils of Myristica fragrans as Potent Antagonists of CC Chemokine Receptor 3. J Nat Prod 79:2005-13 (2016)  
Target
Name:
C-C chemokine receptor type 3
Synonyms:
C-C CKR-3 CC-CKR-3 CCR3 CD_antigen=CD193 CMKBR3 | Eosinophil eotaxin receptor
Type:
Enzyme
Mol. Mass.:
41053.88
Organism:
Homo sapiens (Human)
Description:
P51677
Residue:
355
  
Inhibitor
Name:
BDBM50202469
Synonyms:
CHEMBL3906647
Type:
Small organic molecule
Emp. Form.:
C21H24O5
Mol. Mass.:
356.4123
SMILES:
COc1cc(\C=C\C)cc2[C@@H](C)[C@@H](Oc12)c1cc(OC)c(O)c(OC)c1
: