Target
Nicotinamide phosphoribosyltransferase
Ligand
BDBM50202646
Substrate
Meas. Tech.
ChEMBL_1624778 (CHEMBL3867190)
IC50
5.8±n/a nM
Citation
 Zak, MYuen, PWLiu, XPatel, SSampath, DOeh, JLiederer, BMWang, WO'Brien, TXiao, YSkelton, NHua, RSodhi, JWang, YZhang, LZhao, GZheng, XHo, YCBair, KWDragovich, PS Minimizing CYP2C9 Inhibition of Exposed-Pyridine NAMPT (Nicotinamide Phosphoribosyltransferase) Inhibitors. J Med Chem 59:8345-68 (2016)  
Target
Name:
Nicotinamide phosphoribosyltransferase
Synonyms:
NAMPT NAmPRTase Nicotinamide phosphoribosyltransferase (NAMPT) PBEF1 | Pre-B-cell colony-enhancing factor 1
Type:
Enzyme
Mol. Mass.:
55524.98
Organism:
Homo sapiens (Human)
Description:
P43490
Residue:
491
  
Inhibitor
Name:
BDBM50202646
Synonyms:
CHEMBL3889487 | US11485745, Example 290
Type:
Small organic molecule
Emp. Form.:
C24H34N4O3
Mol. Mass.:
426.5518
SMILES:
O=C(CCC1CCOCC1)N1CCC2(CC2CNC(=O)N2Cc3ccncc3C2)CC1
: