Target
Indoleamine 2,3-dioxygenase 1
Ligand
BDBM50241727
Substrate
Meas. Tech.
ChEMBL_1624966 (CHEMBL3867378)
IC50
78±n/a nM
Citation
 Panda, SRoy, ADeka, SJTrivedi, VManna, D Fused Heterocyclic Compounds as Potent Indoleamine-2,3-dioxygenase 1 Inhibitors. ACS Med Chem Lett 7:1167-1172 (2016)  
Target
Name:
Indoleamine 2,3-dioxygenase 1
Synonyms:
I23O1_HUMAN IDO-1 INDO Indoleamine 2,3-dioxygenase | Indoleamine-pyrrole 2,3-dioxygenase
Type:
Enzyme
Mol. Mass.:
45330.80
Organism:
Homo sapiens (Human)
Description:
P14902
Residue:
403
  
Inhibitor
Name:
BDBM50241727
Synonyms:
(S)-2-amino-3-(1-methyl-1H-indol-3-yl)propanoic acid 1-methyltryptophan L-1-methyl-tryptophan
Type:
Small organic molecule
Emp. Form.:
C12H14N2O2
Mol. Mass.:
218.2518
SMILES:
Cn1cc(C[C@H](N)C(O)=O)c2ccccc12
: