Target
Acetylcholinesterase
Ligand
BDBM50204090
Substrate
Meas. Tech.
ChEMBL_1626142 (CHEMBL3868663)
Ki
0.000590±n/a nM
Citation
 Tommonaro, GGarcía-Font, NVitale, RMPejin, BIodice, CCañadas, SMarco-Contelles, JOset-Gasque, MJ Avarol derivatives as competitive AChE inhibitors, non hepatotoxic and neuroprotective agents for Alzheimer's disease. Eur J Med Chem 122:326-338 (2016)  
Target
Name:
Acetylcholinesterase
Synonyms:
ACES_ELEEL Acetylcholinesterase (EeAChE) | ache
Type:
Enzyme
Mol. Mass.:
71812.79
Organism:
Electrophorus electricus (Electric eel)
Description:
Residue:
633
  
Inhibitor
Name:
BDBM50204090
Synonyms:
CHEMBL3958859
Type:
Small organic molecule
Emp. Form.:
C33H42O4S
Mol. Mass.:
534.749
SMILES:
[#6]\[#6](-[#6])=[#6]\[#6]-[#6]\[#6](-[#6])=[#6]\[#6]-[#6]\[#6](-[#6])=[#6]\[#6]-[#6]\[#6](-[#6])=[#6]\[#6]-c1cc(-[#8])cc(-[#16]-c2ccccc2-[#6](-[#8])=O)c1-[#8]
: