Target
Cholinesterase
Ligand
BDBM50204852
Substrate
Meas. Tech.
ChEMBL_1627989 (CHEMBL3870574)
IC50
8.0±n/a nM
Citation
 Pourabdi, LKhoobi, MNadri, HMoradi, AMoghadam, FHEmami, SMojtahedi, MMHaririan, IForootanfar, HAmeri, AForoumadi, AShafiee, A Synthesis and structure-activity relationship study of tacrine-based pyrano[2,3-c]pyrazoles targeting AChE/BuChE and 15-LOX. Eur J Med Chem 123:298-308 (2016)  
Target
Name:
Cholinesterase
Synonyms:
Acylcholine acylhydrolase Butyrylcholine esterase (BChE) Butyrylcholinesterase (BuChE) CHLE_HUMAN Cholinesterases Pseudocholinesterase
Type:
Homotetramer
Mol. Mass.:
68422.27
Organism:
Homo sapiens (Human)
Description:
P06276
Residue:
602
  
Inhibitor
Name:
BDBM50204852
Synonyms:
CHEMBL3982934
Type:
Small organic molecule
Emp. Form.:
C23H26N4OS
Mol. Mass.:
406.544
SMILES:
CCCc1n[nH]c2Oc3nc4CCCCc4c(N)c3C(c12)c1ccc(SC)cc1
: