Target
Cholinesterase
Ligand
BDBM50204911
Substrate
Meas. Tech.
ChEMBL_1627989 (CHEMBL3870574)
IC50
9.0±n/a nM
Citation
 Pourabdi, LKhoobi, MNadri, HMoradi, AMoghadam, FHEmami, SMojtahedi, MMHaririan, IForootanfar, HAmeri, AForoumadi, AShafiee, A Synthesis and structure-activity relationship study of tacrine-based pyrano[2,3-c]pyrazoles targeting AChE/BuChE and 15-LOX. Eur J Med Chem 123:298-308 (2016)  
Target
Name:
Cholinesterase
Synonyms:
Acylcholine acylhydrolase Butyrylcholine esterase (BChE) Butyrylcholinesterase (BuChE) CHLE_HUMAN Cholinesterases Pseudocholinesterase
Type:
Homotetramer
Mol. Mass.:
68422.27
Organism:
Homo sapiens (Human)
Description:
P06276
Residue:
602
  
Inhibitor
Name:
BDBM50204911
Synonyms:
CHEMBL3957246
Type:
Small organic molecule
Emp. Form.:
C26H24N4O
Mol. Mass.:
408.495
SMILES:
Nc1c2CCCCCc2nc2Oc3[nH]nc(c3C(c3ccccc3)c12)-c1ccccc1
: