Target
Cholinesterase
Ligand
BDBM50204859
Substrate
Meas. Tech.
ChEMBL_1627989 (CHEMBL3870574)
IC50
7.0±n/a nM
Citation
 Pourabdi, LKhoobi, MNadri, HMoradi, AMoghadam, FHEmami, SMojtahedi, MMHaririan, IForootanfar, HAmeri, AForoumadi, AShafiee, A Synthesis and structure-activity relationship study of tacrine-based pyrano[2,3-c]pyrazoles targeting AChE/BuChE and 15-LOX. Eur J Med Chem 123:298-308 (2016)  
Target
Name:
Cholinesterase
Synonyms:
Acylcholine acylhydrolase Butyrylcholine esterase (BChE) Butyrylcholinesterase (BuChE) CHLE_HUMAN Cholinesterases Pseudocholinesterase
Type:
Homotetramer
Mol. Mass.:
68422.27
Organism:
Homo sapiens (Human)
Description:
P06276
Residue:
602
  
Inhibitor
Name:
BDBM50204859
Synonyms:
CHEMBL3939483
Type:
Small organic molecule
Emp. Form.:
C26H22FN3O
Mol. Mass.:
411.4708
SMILES:
Nc1c2CCCCc2cc2Oc3[nH]nc(c3C(c3ccc(F)cc3)c12)-c1ccccc1
: