Target
Aurora kinase B
Ligand
BDBM50206409
Substrate
Meas. Tech.
ChEMBL_1628980 (CHEMBL3871606)
IC50
30±n/a nM
Citation
 Chang, CFLin, WHKe, YYLin, YSWang, WCChen, CHKuo, PCHsu, JTAUang, BJHsieh, HP Discovery of novel inhibitors of Aurora kinases with indazole scaffold: In silico fragment-based and knowledge-based drug design. Eur J Med Chem 124:186-199 (2016)  
Target
Name:
Aurora kinase B
Synonyms:
AIK2 AIM1 ARK2 AURKB_HUMAN Aurora B-INCENP Aurora kinase B (AURKB) STK-1 STK12 Serine/threonine-protein kinase aurora B
Type:
Protein
Mol. Mass.:
39327.72
Organism:
Homo sapiens (Human)
Description:
Q96GD4
Residue:
344
  
Inhibitor
Name:
BDBM50206409
Synonyms:
CHEMBL3983327
Type:
Small organic molecule
Emp. Form.:
C23H17FN4O5S
Mol. Mass.:
480.468
SMILES:
OC(=O)\C=C/C(=O)Nc1cccc(c1)-c1n[nH]c2ccc(NS(=O)(=O)c3ccc(F)cc3)cc12
: