Target
Vascular endothelial growth factor receptor 1
Ligand
BDBM50206389
Substrate
Meas. Tech.
ChEMBL_1628975 (CHEMBL3871601)
IC50
0.100000±n/a nM
Citation
 Chang, CFLin, WHKe, YYLin, YSWang, WCChen, CHKuo, PCHsu, JTAUang, BJHsieh, HP Discovery of novel inhibitors of Aurora kinases with indazole scaffold: In silico fragment-based and knowledge-based drug design. Eur J Med Chem 124:186-199 (2016)  
Target
Name:
Vascular endothelial growth factor receptor 1
Synonyms:
FLT FRT Fms-like tyrosine kinase 1 Tyrosine-protein kinase FRT VEGFR-1 VGFR1_HUMAN Vascular endothelial growth factor receptor 1 (FLT1) Vascular endothelial growth factor receptor 1 and 2 (Flt-1 and KDR) Vascular permeability factor receptor vascular endothelial growth factor/vascular permeability factor receptor
Type:
Receptor Tyrosine Kinase
Mol. Mass.:
150800.23
Organism:
Homo sapiens (Human)
Description:
P17948
Residue:
1338
  
Inhibitor
Name:
BDBM50206389
Synonyms:
CHEMBL3939307
Type:
Small organic molecule
Emp. Form.:
C22H20N4OS
Mol. Mass.:
388.485
SMILES:
CNC(=O)c1ccccc1Sc1ccc2c(CCc3ccccn3)n[nH]c2c1
: