Target
Aurora kinase A
Ligand
BDBM50206417
Substrate
Meas. Tech.
ChEMBL_1628978 (CHEMBL3871604)
IC50
>1000±n/a nM
Citation
 Chang, CFLin, WHKe, YYLin, YSWang, WCChen, CHKuo, PCHsu, JTAUang, BJHsieh, HP Discovery of novel inhibitors of Aurora kinases with indazole scaffold: In silico fragment-based and knowledge-based drug design. Eur J Med Chem 124:186-199 (2016)  
Target
Name:
Aurora kinase A
Synonyms:
AIK ARK1 AURKA AYK1 Aurora kinase A (AURA) Aurora kinase A (Aurora A) Aurora-related kinase 1 BTAK Breast-tumor-amplified kinase STK15 Serine/threonine kinase 15 Serine/threonine-protein kinase aurora A hARK1
Type:
Serine/threonine-protein kinase
Mol. Mass.:
45830.98
Organism:
Homo sapiens (Human)
Description:
O14965
Residue:
403
  
Inhibitor
Name:
BDBM50206417
Synonyms:
CHEMBL3964280
Type:
Small organic molecule
Emp. Form.:
C29H22N4O5S
Mol. Mass.:
538.574
SMILES:
OC(=O)\C=C/C(=O)Nc1cccc(c1)-c1n[nH]c2ccc(NS(=O)(=O)c3ccc(cc3)-c3ccccc3)cc12
: