Target
5-hydroxytryptamine receptor 2A
Ligand
BDBM50001915
Substrate
Meas. Tech.
ChEMBL_1629229 (CHEMBL3871855)
EC50
251±n/a nM
Citation
 Schrader, TOKasem, MRen, AFeichtinger, KAl Doori, BWei, JWu, CDang, HLe, MGatlin, JChase, KDong, JWhelan, KTSage, CGrottick, AJSemple, G Tetrahydroquinoline-based tricyclic amines as potent and selective agonists of the 5-HT Bioorg Med Chem Lett 26:5877-5882 (2016)  
Target
Name:
5-hydroxytryptamine receptor 2A
Synonyms:
5-HT-2 5-HT2A 5-hydroxytryptamine receptor 2A (5HT-2A) 5HT2A_HUMAN HTR2A | Serotonin receptor 2A
Type:
undefined
Mol. Mass.:
52607.65
Organism:
Homo sapiens (Human)
Description:
P28223
Residue:
471
  
Inhibitor
Name:
BDBM50001915
Synonyms:
1-(3-chlorophenyl)piperazine m-Chlorophenylpiperazine | mCPP
Type:
Small organic molecule
Emp. Form.:
C10H13ClN2
Mol. Mass.:
196.677
SMILES:
Clc1cccc(c1)N1CCNCC1
: