Target
Sodium-dependent serotonin transporter
Ligand
BDBM50010859
Substrate
Meas. Tech.
ChEMBL_1629249 (CHEMBL3871875)
Ki
2.0±n/a nM
Citation
 Yoshinaga, HMasumoto, SKoyama, KKinomura, NMatsumoto, YKato, TBaba, SMatsumoto, KHorisawa, TOki, HYabuuchi, KKodo, T Discovery of SMP-304, a novel benzylpiperidine derivative with serotonin transporter inhibitory activity and 5-HT Bioorg Med Chem 25:293-304 (2017)  
Target
Name:
Sodium-dependent serotonin transporter
Synonyms:
5-HT Transporter 5HTT SC6A4_HUMAN SLC6A4 Serotonin transporter (5HTT) Sodium-dependent serotonin transporter (SERT) | Solute carrier family 6 member 4
Type:
Multi-pass membrane protein
Mol. Mass.:
70322.51
Organism:
Homo sapiens (Human)
Description:
P31645
Residue:
630
  
Inhibitor
Name:
BDBM50010859
Synonyms:
CHEMBL11 IMIPRAMINE PAMOATE | Imipramin
Type:
Small organic molecule
Emp. Form.:
C19H24N2
Mol. Mass.:
280.4073
SMILES:
CN(C)CCCN1c2ccccc2CCc2ccccc12
: