Target
Tyrosine-protein kinase Yes
Ligand
BDBM50206819
Substrate
Meas. Tech.
ChEMBL_1629295 (CHEMBL3871921)
Ki
79±n/a nM
Citation
 Morioka, M 3-Cyano-6-(5-methyl-3-pyrazoloamino) pyridines (Part 2): A dual inhibitor of Aurora kinase and tubulin polymerization. Bioorg Med Chem Lett 26:5860-5862 (2016)  
Target
Name:
Tyrosine-protein kinase Yes
Synonyms:
Proto-oncogene c-Yes YES YES_HUMAN | p61-yes
Type:
Protein
Mol. Mass.:
60801.54
Organism:
Homo sapiens (Human)
Description:
P07947
Residue:
543
  
Inhibitor
Name:
BDBM50206819
Synonyms:
CHEMBL3893914
Type:
Small organic molecule
Emp. Form.:
C19H21N7O
Mol. Mass.:
363.4163
SMILES:
Cc1cc(Nc2cc(C)c(C#N)c(NCCOc3ccc(C)nc3)n2)n[nH]1
: