Target
Cytochrome P450 2C9
Ligand
BDBM50206819
Substrate
Meas. Tech.
ChEMBL_1629311 (CHEMBL3871937)
IC50
4900±n/a nM
Citation
 Morioka, M 3-Cyano-6-(5-methyl-3-pyrazoloamino) pyridines (Part 2): A dual inhibitor of Aurora kinase and tubulin polymerization. Bioorg Med Chem Lett 26:5860-5862 (2016)  
Target
Name:
Cytochrome P450 2C9
Synonyms:
(R)-limonene 6-monooxygenase CP2C9_HUMAN CYP2C9 Cytochrome P450 2C9 (CYP2C9 ) P-450MP P450 PB-1 | S-mephenytoin 4-hydroxylase
Type:
Enzyme
Mol. Mass.:
55636.33
Organism:
Homo sapiens (Human)
Description:
P11712
Residue:
490
  
Inhibitor
Name:
BDBM50206819
Synonyms:
CHEMBL3893914
Type:
Small organic molecule
Emp. Form.:
C19H21N7O
Mol. Mass.:
363.4163
SMILES:
Cc1cc(Nc2cc(C)c(C#N)c(NCCOc3ccc(C)nc3)n2)n[nH]1
: