Target
D(2) dopamine receptor
Ligand
BDBM50207155
Substrate
Meas. Tech.
ChEMBL_1630049 (CHEMBL3872755)
Ki
0.300000±n/a nM
Citation
 Chen, XWSun, YYFu, LLi, JQ Synthesis and pharmacological characterization of novel N-(trans-4-(2-(4-(benzo[d]isothiazol-3-yl)piperazin-1-yl)ethyl)cyclohexyl)amides as potential multireceptor atypical antipsychotics. Eur J Med Chem 123:332-353 (2016)  
Target
Name:
D(2) dopamine receptor
Synonyms:
D(2) dopamine receptor DOPAMINE D2 Long DRD2 Dopamine D2 receptor Dopamine D2 receptor (D2R) Dopamine2-like | d2
Type:
Cell-surface receptors
Mol. Mass.:
50647.10
Organism:
Homo sapiens (Human)
Description:
P14416
Residue:
443
  
Inhibitor
Name:
BDBM50207155
Synonyms:
CHEMBL3895540
Type:
Small organic molecule
Emp. Form.:
C24H32N4O2S3
Mol. Mass.:
504.731
SMILES:
CN([C@H]1CC[C@H](CCN2CCN(CC2)c2nsc3ccccc23)CC1)S(=O)(=O)c1cccs1
: