Target
D(3) dopamine receptor
Ligand
BDBM50207116
Substrate
Meas. Tech.
ChEMBL_1630050 (CHEMBL3872756)
Ki
0.029000±n/a nM
Citation
 Chen, XWSun, YYFu, LLi, JQ Synthesis and pharmacological characterization of novel N-(trans-4-(2-(4-(benzo[d]isothiazol-3-yl)piperazin-1-yl)ethyl)cyclohexyl)amides as potential multireceptor atypical antipsychotics. Eur J Med Chem 123:332-353 (2016)  
Target
Name:
D(3) dopamine receptor
Synonyms:
DOPAMINE D3 DRD3_HUMAN Dopamine D3 receptor (D3) Dopamine receptor Dopamine receptor D3
Type:
Mol. Mass.:
44243.43
Organism:
Homo sapiens (Human)
Description:
Residue:
400
  
Inhibitor
Name:
BDBM50207116
Synonyms:
CHEMBL3905247 | US9550741, I-4
Type:
Small organic molecule
Emp. Form.:
C28H33N5OS
Mol. Mass.:
487.66
SMILES:
O=C(N[C@H]1CC[C@H](CCN2CCN(CC2)c2nsc3ccccc23)CC1)c1cc2ccccc2[nH]1
: