Target
Cannabinoid receptor 1
Ligand
BDBM50207269
Substrate
Meas. Tech.
ChEMBL_1630565 (CHEMBL3873271)
IC50
8400±n/a nM
Citation
 Romero-Parra, JMella-Raipán, JPalmieri, VAllarà, MTorres, MJPessoa-Mahana, HIturriaga-Vásquez, PEscobar, RFaúndez, MDi Marzo, VPessoa-Mahana, CD Synthesis, binding assays, cytotoxic activity and docking studies of benzimidazole and benzothiophene derivatives with selective affinity for the CB2 cannabinoid receptor. Eur J Med Chem 124:17-35 (2016)  
Target
Name:
Cannabinoid receptor 1
Synonyms:
CANN6 CB-R CNR CNR1_HUMAN Cannabinoid receptor Cannabinoid receptor 1 (brain)
Type:
G Protein-Coupled Receptor (GPCR)
Mol. Mass.:
52868.96
Organism:
Homo sapiens (Human)
Description:
P21554
Residue:
472
  
Inhibitor
Name:
BDBM50207269
Synonyms:
CHEMBL3907434
Type:
Small organic molecule
Emp. Form.:
C26H18O2S
Mol. Mass.:
394.485
SMILES:
COc1ccc(cc1)-c1sc2ccccc2c1C(=O)c1cccc2ccccc12
: