Target
Amine oxidase [flavin-containing] B
Ligand
BDBM10989
Substrate
Meas. Tech.
ChEMBL_1631970 (CHEMBL3874676)
IC50
83±n/a nM
Citation
 Li, YQiang, XLuo, LYang, XXiao, GZheng, YCao, ZSang, ZSu, FDeng, Y Multitarget drug design strategy against Alzheimer's disease: Homoisoflavonoid Mannich base derivatives serve as acetylcholinesterase and monoamine oxidase B dual inhibitors with multifunctional properties. Bioorg Med Chem 25:714-726 (2017)  
Target
Name:
Amine oxidase [flavin-containing] B
Synonyms:
AOFB_HUMAN MAOB Monoamine oxidase type B (MAO B) Monoamine oxidase type B (MAOB)
Type:
Protein
Mol. Mass.:
58768.76
Organism:
Homo sapiens (Human)
Description:
P27338
Residue:
520
  
Inhibitor
Name:
BDBM10989
Synonyms:
(1R)-N-(prop-2-yn-1-yl)-2,3-dihydro-1H-inden-1-amine Rasagiline | US9034303, Rasagiline
Type:
Small organic molecule
Emp. Form.:
C12H13N
Mol. Mass.:
171.2383
SMILES:
C#CCN[C@@H]1CCc2ccccc12
: