Target
Muscarinic acetylcholine receptor M4
Ligand
BDBM50207524
Substrate
Meas. Tech.
ChEMBL_1631985 (CHEMBL3874691)
EC50
51±n/a nM
Citation
 Wood, MRNoetzel, MJPoslusney, MSMelancon, BJTarr, JCLamsal, AChang, SLuscombe, VBWeiner, RLCho, HPBubser, MJones, CKNiswender, CMWood, MWEngers, DWBrandon, NJDuggan, MEConn, PJBridges, TMLindsley, CW Challenges in the development of an M Bioorg Med Chem Lett 27:171-175 (2017)  
Target
Name:
Muscarinic acetylcholine receptor M4
Synonyms:
ACM4_RAT Chrm-4 | Chrm4
Type:
Enzyme Catalytic Domain
Mol. Mass.:
52841.70
Organism:
RAT
Description:
Cholinergic, muscarinic M4 CHRM4 RAT::P08485
Residue:
477
  
Inhibitor
Name:
BDBM50207524
Synonyms:
CHEMBL3974708
Type:
Small organic molecule
Emp. Form.:
C17H18N4O3S2
Mol. Mass.:
390.48
SMILES:
Cc1nnc2sc(C(=O)NCc3ccc(cc3)S(C)(=O)=O)c(N)c2c1C
: