Target
Muscarinic acetylcholine receptor M4
Ligand
BDBM50207523
Substrate
Meas. Tech.
ChEMBL_1631985 (CHEMBL3874691)
EC50
11±n/a nM
Citation
 Wood, MRNoetzel, MJPoslusney, MSMelancon, BJTarr, JCLamsal, AChang, SLuscombe, VBWeiner, RLCho, HPBubser, MJones, CKNiswender, CMWood, MWEngers, DWBrandon, NJDuggan, MEConn, PJBridges, TMLindsley, CW Challenges in the development of an M Bioorg Med Chem Lett 27:171-175 (2017)  
Target
Name:
Muscarinic acetylcholine receptor M4
Synonyms:
ACM4_RAT Chrm-4 | Chrm4
Type:
Enzyme Catalytic Domain
Mol. Mass.:
52841.70
Organism:
RAT
Description:
Cholinergic, muscarinic M4 CHRM4 RAT::P08485
Residue:
477
  
Inhibitor
Name:
BDBM50207523
Synonyms:
CHEMBL3982695
Type:
Small organic molecule
Emp. Form.:
C17H18N4OS2
Mol. Mass.:
358.481
SMILES:
CSc1ccc(CNC(=O)c2sc3nnc(C)c(C)c3c2N)cc1
: