Target
Acetylcholinesterase
Ligand
BDBM8960
Substrate
Meas. Tech.
ChEMBL_1632479 (CHEMBL3875271)
IC50
10.0±n/a nM
Citation
 Wieckowska, AKolaczkowski, MBucki, AGodyn, JMarcinkowska, MWieckowski, KZareba, PSiwek, AKazek, GGluch-Lutwin, MMierzejewski, PBienkowski, PSienkiewicz-Jarosz, HKnez, DWichur, TGobec, SMalawska, B Novel multi-target-directed ligands for Alzheimer's disease: Combining cholinesterase inhibitors and 5-HT Eur J Med Chem 124:63-81 (2016)  
Target
Name:
Acetylcholinesterase
Synonyms:
ACES_ELEEL Acetylcholinesterase (EeAChE) | ache
Type:
Enzyme
Mol. Mass.:
71812.79
Organism:
Electrophorus electricus (Electric eel)
Description:
Residue:
633
  
Inhibitor
Name:
BDBM8960
Synonyms:
(+/-)-2-[(1-benzylpiperidin-4-yl)methyl]-5,6-dimethoxy-indan-1-one Aricept CHEMBL1678 CHEMBL502 Donepezil E2020 US9346818, DPH US9663465, Donepezil
Type:
Small organic molecule
Emp. Form.:
C24H29NO3
Mol. Mass.:
379.492
SMILES:
COc1cc2CC(CC3CCN(Cc4ccccc4)CC3)C(=O)c2cc1OC
: