Target
5-hydroxytryptamine receptor 2A
Ligand
BDBM50208451
Substrate
Meas. Tech.
ChEMBL_1632886 (CHEMBL3875678)
Ki
0.500000±n/a nM
Citation
 Cao, XChen, YZhang, YQiu, YYu, MXu, XLiu, XLiu, BFZhang, G Synthesis and biological evaluation of new 6-hydroxypyridazinone benzisoxazoles: Potential multi-receptor-targeting atypical antipsychotics. Eur J Med Chem 124:713-728 (2016)  
Target
Name:
5-hydroxytryptamine receptor 2A
Synonyms:
5-HT-2A 5-HT2A 5-hydroxytryptamine receptor 2A (5HT2A) Htr2 Serotonin Receptor 2A
Type:
G Protein-Coupled Receptor (GPCR)
Mol. Mass.:
52852.05
Organism:
Rattus norvegicus (rat)
Description:
Rat cortex membranes 5-HT2A receptors.
Residue:
471
  
Inhibitor
Name:
BDBM50208451
Synonyms:
CHEMBL3885471
Type:
Small organic molecule
Emp. Form.:
C25H23Cl2FN4O3
Mol. Mass.:
517.38
SMILES:
Fc1ccc2c(noc2c1)C1CCN(CCCOc2ccc(=O)n(n2)-c2cccc(Cl)c2Cl)CC1
: