Target
Histone deacetylase 2
Ligand
BDBM50209792
Substrate
Meas. Tech.
ChEBML_1634158
IC50
294±n/a nM
Citation
 Raji, IYadudu, FJaneira, EFathi, SSzymczak, LKornacki, JRKomatsu, KLi, JDMrksich, MOyelere, AK Bifunctional conjugates with potent inhibitory activity towards cyclooxygenase and histone deacetylase. Bioorg Med Chem 25:1202-1218 (2017)  
Target
Name:
Histone deacetylase 2
Synonyms:
Cereblon/Histone deacetylase 2 HDAC2 Histone deacetylase 2 (HDAC2) | Human HDAC2
Type:
Chromatin regulator; hydrolase; repressor
Mol. Mass.:
55356.54
Organism:
Homo sapiens (Human)
Description:
Q92769
Residue:
488
  
Inhibitor
Name:
BDBM50209792
Synonyms:
CHEMBL3884279
Type:
Small organic molecule
Emp. Form.:
C24H29N5O5S
Mol. Mass.:
499.583
SMILES:
Cc1ccc(cc1)-c1cc(nn1-c1ccc(cc1)S(N)(=O)=O)C(=O)NCCCCCCC(=O)NO
: