Target
Histone deacetylase 1
Ligand
BDBM50209794
Substrate
Meas. Tech.
ChEMBL_1634157 (CHEMBL3876949)
IC50
1810±n/a nM
Citation
 Raji, IYadudu, FJaneira, EFathi, SSzymczak, LKornacki, JRKomatsu, KLi, JDMrksich, MOyelere, AK Bifunctional conjugates with potent inhibitory activity towards cyclooxygenase and histone deacetylase. Bioorg Med Chem 25:1202-1218 (2017)  
Target
Name:
Histone deacetylase 1
Synonyms:
Cereblon/Histone deacetylase 1 HDAC1 Histone deacetylase 1 (HDAC1) RPD3L1
Type:
Enzyme
Mol. Mass.:
55090.27
Organism:
Homo sapiens (Human)
Description:
Q13547
Residue:
482
  
Inhibitor
Name:
BDBM50209794
Synonyms:
CHEMBL3884118
Type:
Small organic molecule
Emp. Form.:
C25H28ClN3O5
Mol. Mass.:
485.96
SMILES:
COc1ccc2n(C(=O)c3ccc(Cl)cc3)c(C)c(CC(=O)NCCCCCC(=O)NO)c2c1
: