Target
Myeloperoxidase
Ligand
BDBM50336507
Substrate
Meas. Tech.
ChEMBL_1634341 (CHEMBL3877133)
IC50
5000±n/a nM
Citation
 Soubhye, JGelbcke, MVan Antwerpen, PDufrasne, FBoufadi, MYNève, JFurtmüller, PGObinger, CZouaoui Boudjeltia, KMeyer, F From Dynamic Combinatorial Chemistry to ACS Med Chem Lett 8:206-210 (2017)  
Target
Name:
Myeloperoxidase
Synonyms:
84 kDa myeloperoxidase MPO Myeloperoxidase Myeloperoxidase heavy chain PERM_HUMAN
Type:
Enzyme
Mol. Mass.:
83888.32
Organism:
Homo sapiens (Human)
Description:
P05164
Residue:
745
  
Inhibitor
Name:
BDBM50336507
Synonyms:
4-pyridinecarbohydrazide(Isoniazid) Dow-isoniazid INH Isoniazid (INH) Isonicotinic acid hydrazide(Isoniazid) Laniazid Rimifon isoniazid isonicotinhydrazide isonicotinyl hydrazide | pyridine-4-carbohydrazide
Type:
Small organic molecule
Emp. Form.:
C6H7N3O
Mol. Mass.:
137.1393
SMILES:
NNC(=O)c1ccncc1
: