Target
Epidermal growth factor receptor
Ligand
BDBM50210162
Substrate
Meas. Tech.
ChEMBL_1634421 (CHEMBL3877213)
Ki
0.140000±n/a nM
Citation
 Munoz, L Non-kinase targets of protein kinase inhibitors. Nat Rev Drug Discov 16:424-440 (2017)  
Target
Name:
Epidermal growth factor receptor
Synonyms:
EGF Receptor Substrate EGFR_HUMAN ERBB1 Epidermal Growth Factor Receptor erbB-1 Epidermal growth factor receptor (EGFR) HER1 Proto-oncogene c-ErbB-1 Tyrosine-Protein Kinase ErbB-1
Type:
Receptor Kinase Domain
Mol. Mass.:
134279.59
Organism:
Homo sapiens (Human)
Description:
P00533
Residue:
1210
  
Inhibitor
Name:
BDBM50210162
Synonyms:
CHEMBL3883534
Type:
Small organic molecule
Emp. Form.:
C18H14ClFN4O2
Mol. Mass.:
372.781
SMILES:
COc1cc2ncnc(Nc3ccc(F)c(Cl)c3)c2cc1NC(=O)C=C
: