Target
Histone deacetylase 11
Ligand
BDBM50210167
Substrate
Meas. Tech.
ChEMBL_1634470 (CHEMBL3877368)
IC50
930±n/a nM
Citation
 Yang, EGMustafa, NTan, ECPoulsen, ARamanujulu, PMChng, WJYen, JJDymock, BW Design and Synthesis of Janus Kinase 2 (JAK2) and Histone Deacetlyase (HDAC) Bispecific Inhibitors Based on Pacritinib and Evidence of Dual Pathway Inhibition in Hematological Cell Lines. J Med Chem 59:8233-62 (2016)  
Target
Name:
Histone deacetylase 11
Synonyms:
HD11 HDAC11 | Human HDAC11
Type:
Chromatin regulator; hydrolase; repressor
Mol. Mass.:
39187.66
Organism:
Homo sapiens (Human)
Description:
Q96DB2
Residue:
347
  
Inhibitor
Name:
BDBM50210167
Synonyms:
CHEMBL3917405
Type:
Small organic molecule
Emp. Form.:
C29H34N4O5
Mol. Mass.:
518.6041
SMILES:
ONC(=O)CCCCCCOc1ccc2Nc3nccc(n3)-c3cccc(COC\C=C\COCc1c2)c3
: