Target
Tyrosine-protein kinase JAK2
Ligand
BDBM50210189
Substrate
Meas. Tech.
ChEMBL_1634447 (CHEMBL3877345)
IC50
<39±n/a nM
Citation
 Yang, EGMustafa, NTan, ECPoulsen, ARamanujulu, PMChng, WJYen, JJDymock, BW Design and Synthesis of Janus Kinase 2 (JAK2) and Histone Deacetlyase (HDAC) Bispecific Inhibitors Based on Pacritinib and Evidence of Dual Pathway Inhibition in Hematological Cell Lines. J Med Chem 59:8233-62 (2016)  
Target
Name:
Tyrosine-protein kinase JAK2
Synonyms:
JAK-2 JAK2_HUMAN Janus kinase 2 (JAK2) | Janus kinase 2 (a protein tyrosine kinase)
Type:
Protein
Mol. Mass.:
130684.68
Organism:
Homo sapiens (Human)
Description:
O60674
Residue:
1132
  
Inhibitor
Name:
BDBM50210189
Synonyms:
CHEMBL3911929
Type:
Small organic molecule
Emp. Form.:
C27H29N3O5
Mol. Mass.:
475.5363
SMILES:
OC(=O)CCCCOc1ccc2Nc3nccc(n3)-c3cccc(COC\C=C\COCc1c2)c3
: