Target
Tyrosine-protein kinase JAK2
Ligand
BDBM50210178
Substrate
Meas. Tech.
ChEMBL_1634446 (CHEMBL3877344)
IC50
6.9±n/a nM
Citation
 Yang, EGMustafa, NTan, ECPoulsen, ARamanujulu, PMChng, WJYen, JJDymock, BW Design and Synthesis of Janus Kinase 2 (JAK2) and Histone Deacetlyase (HDAC) Bispecific Inhibitors Based on Pacritinib and Evidence of Dual Pathway Inhibition in Hematological Cell Lines. J Med Chem 59:8233-62 (2016)  
Target
Name:
Tyrosine-protein kinase JAK2
Synonyms:
JAK-2 JAK2_HUMAN Janus kinase 2 (JAK2) | Janus kinase 2 (a protein tyrosine kinase)
Type:
Protein
Mol. Mass.:
130684.68
Organism:
Homo sapiens (Human)
Description:
O60674
Residue:
1132
  
Inhibitor
Name:
BDBM50210178
Synonyms:
CHEMBL3933593
Type:
Small organic molecule
Emp. Form.:
C37H42N6O6
Mol. Mass.:
666.766
SMILES:
ONC(=O)CCCCCC(=O)Nc1ccc(NCCOc2ccc3Nc4nccc(n4)-c4cccc(COC\C=C\COCc2c3)c4)cc1
: