Target
Aldo-keto reductase family 1 member B1
Ligand
BDBM50049730
Substrate
Meas. Tech.
ChEMBL_1635519 (CHEMBL3878417)
IC50
85±n/a nM
Citation
 Saito, RHoshi, MKato, AIshikawa, CKomatsu, T Green fluorescent protein chromophore derivatives as a new class of aldose reductase inhibitors. Eur J Med Chem 125:965-974 (2017)  
Target
Name:
Aldo-keto reductase family 1 member B1
Synonyms:
AKR1B1 ALDR_HUMAN AR Aldose Reductase (ALR2) Aldose reductase (AR)
Type:
Protein
Mol. Mass.:
35855.50
Organism:
Homo sapiens (Human)
Description:
P15121. 4LAU; 2IKI; 4LB4; 2FZD; 2FZ8; 1US0
Residue:
316
  
Inhibitor
Name:
BDBM50049730
Synonyms:
2-(5-(2-methyl-3-phenylallylidene)-4-oxo-2-thioxothiazolidin-3-yl)acetic acid Epalrestat | {5-[(E)-2-Methyl-3-phenyl-prop-2-en-(Z)-ylidene]-4-oxo-2-thioxo-thiazolidin-3-yl}-acetic acid
Type:
Small organic molecule
Emp. Form.:
C15H13NO3S2
Mol. Mass.:
319.399
SMILES:
C\C(\C=C1/SC(=S)N(CC(O)=O)C1=O)=C/c1ccccc1
: