Target
Monoacylglycerol lipase ABHD6
Ligand
BDBM50211268
Substrate
Meas. Tech.
ChEBML_1636269
IC50
158±n/a nM
Citation
 Deng, HKooijman, Svan den Nieuwendijk, AMOgasawara, Dvan der Wel, Tvan Dalen, FBaggelaar, MPJanssen, FJvan den Berg, RJden Dulk, HCravatt, BFOverkleeft, HSRensen, PCvan der Stelt, M Triazole Ureas Act as Diacylglycerol Lipase Inhibitors and Prevent Fasting-Induced Refeeding. J Med Chem 60:428-440 (2017)  
Target
Name:
Monoacylglycerol lipase ABHD6
Synonyms:
2-arachidonoylglycerol hydrolase ABHD6_HUMAN Monoacylglycerol lipase ABHD6
Type:
PROTEIN
Mol. Mass.:
38341.83
Organism:
Homo sapiens (Human)
Description:
ChEMBL_105457
Residue:
337
  
Inhibitor
Name:
BDBM50211268
Synonyms:
CHEMBL3912754
Type:
Small organic molecule
Emp. Form.:
C28H26F2N4O3
Mol. Mass.:
504.5278
SMILES:
O[C@@H]1CC[C@H](Cc2ccccc2)N(C1)C(=O)n1ncc(n1)C(O)(c1ccc(F)cc1)c1ccc(F)cc1
: