Target
Methionine aminopeptidase 2
Ligand
BDBM32203
Substrate
Meas. Tech.
ChEMBL_1636404 (CHEMBL3879302)
IC50
1270±n/a nM
Citation
 Helgren, TRChen, CWangtrakuldee, PEdwards, TEStaker, BLAbendroth, JSankaran, BHousley, NAMyler, PJAudia, JPHorn, JRHagen, TJ Rickettsia prowazekii methionine aminopeptidase as a promising target for the development of antibacterial agents. Bioorg Med Chem 25:813-824 (2017)  
Target
Name:
Methionine aminopeptidase 2
Synonyms:
Initiation factor 2-associated 67 kDa glycoprotein MAP2_HUMAN MNPEP Methionine aminopeptidase 2 (MetAP2) P67EIF2 p67
Type:
Enzyme
Mol. Mass.:
52884.45
Organism:
Homo sapiens (Human)
Description:
P50579
Residue:
478
  
Inhibitor
Name:
BDBM32203
Synonyms:
8-quinolinol US10005735, Table 1.7 cid_1923 quinolin-8-ol
Type:
Small organic molecule
Emp. Form.:
C9H7NO
Mol. Mass.:
145.158
SMILES:
Oc1cccc2cccnc12
: