Target
Endoplasmic reticulum aminopeptidase 2
Ligand
BDBM50400206
Substrate
Meas. Tech.
ChEMBL_1636857 (CHEMBL3879755)
IC50
>100000±n/a nM
Citation
 Mpakali, AGiastas, PDeprez-Poulain, RPapakyriakou, AKoumantou, DGealageas, RTsoukalidou, SVourloumis, DMavridis, IMStratikos, ESaridakis, E Crystal Structures of ERAP2 Complexed with Inhibitors Reveal Pharmacophore Requirements for Optimizing Inhibitor Potency. ACS Med Chem Lett 8:333-337 (2017)  
Target
Name:
Endoplasmic reticulum aminopeptidase 2
Synonyms:
Aminopeptidase ERAP2_HUMAN | LRAP
Type:
PROTEIN
Mol. Mass.:
110463.90
Organism:
Homo sapiens (Human)
Description:
ChEMBL_1473169
Residue:
960
  
Inhibitor
Name:
BDBM50400206
Synonyms:
CHEMBL2180993
Type:
Small organic molecule
Emp. Form.:
C17H17FN2O3
Mol. Mass.:
316.3269
SMILES:
ONC(=O)C(Cc1ccc(F)cc1)C(=O)NCc1ccccc1
: