Target
5-hydroxytryptamine receptor 1A
Ligand
BDBM82368
Substrate
Meas. Tech.
ChEMBL_1540 (CHEMBL616363)
IC50
0.20±n/a nM
Citation
  Fluorescent probes for 5-HT1A receptors: Synthesis and characterization of 5-methoxy-3-[n-propyl(4-n-aminobutyl)] amino-3,4-dihydro-2H-1-benzopyran derivatives Bioorg Med Chem Lett 3:1935-1940 (1993)   
Target
Name:
5-hydroxytryptamine receptor 1A
Synonyms:
5-HT-1A 5-hydroxytryptamine receptor 1A (5-HT-1A) ADRB2RL1 Dopamine D2 receptor and serotonin 1a receptor HTR1A | Serotonin receptor 1A
Type:
Mol. Mass.:
46122.49
Organism:
Homo sapiens (Human)
Description:
Residue:
422
  
Inhibitor
Name:
BDBM82368
Synonyms:
CAS_121851 CHEMBL301060 S 20499
Type:
Small organic molecule
Emp. Form.:
C26H38N2O4
Mol. Mass.:
442.5909
SMILES:
CCCN(CCCCN1C(=O)CC2(CCCC2)CC1=O)C1COc2cccc(OC)c2C1
: