Target
Leukotriene B4 receptor 1/2
Ligand
BDBM50052021
Substrate
Meas. Tech.
ChEMBL_98628 (CHEMBL711829)
Ki
1.000000±n/a nM
Citation
  TBA Bioorg Med Chem Lett 4:2883-2888 (1994)   
Target
Name:
Leukotriene B4 receptor 1/2
Synonyms:
Leukotriene B4 receptor
Type:
Mol. Mass.:
Description:
ASSAY_ID of ChEMBL is 88360
Components:
This complex has 2 components.
Component 1
Name:
Leukotriene B4 receptor 2
Synonyms:
BLT2R LT4R2_HUMAN LTB4-R 2 LTB4R2 Leukotriene B4 Leukotriene B4 receptor Leukotriene B4 receptor BLT2 Seven transmembrane receptor BLTR2
Type:
Enzyme Catalytic Domain
Mol. Mass.:
37964.86
Organism:
Homo sapiens (Human)
Description:
Leukotriene 2 0 HUMAN::Q9NPC1
Residue:
358
  
Component 2
Name:
Leukotriene B4 receptor 1
Synonyms:
BLT BLTR Chemoattractant receptor-like 1 GPR16 LTB4-R 1 Leukotriene B4 R1 Leukotriene B4 receptor 1 P2Y purinoceptor 7 | P2Y7
Type:
Enzyme Catalytic Domain
Mol. Mass.:
37582.68
Organism:
Homo sapiens (Human)
Description:
Q15722
Residue:
352
  
Inhibitor
Name:
BDBM50052021
Synonyms:
4-[5-(4-Carbamimidoyl-phenoxy)-pentyloxy]-N,N-diisopropyl-3-methoxy-benzamide CHEMBL89326
Type:
Small organic molecule
Emp. Form.:
C26H37N3O4
Mol. Mass.:
455.5897
SMILES:
COc1cc(ccc1OCCCCCOc1ccc(cc1)C(N)=N)C(=O)N(C(C)C)C(C)C
: