Target
Leukotriene B4 receptor 1
Ligand
BDBM50213057
Substrate
Meas. Tech.
ChEMBL_99497 (CHEMBL705027)
Ki
3.0±n/a nM
Citation
  TBA Bioorg Med Chem Lett 4:795-800 (1994)   
Target
Name:
Leukotriene B4 receptor 1
Synonyms:
BLT BLTR Chemoattractant receptor-like 1 GPR16 LTB4-R 1 Leukotriene B4 R1 Leukotriene B4 receptor 1 P2Y purinoceptor 7 | P2Y7
Type:
Enzyme Catalytic Domain
Mol. Mass.:
37582.68
Organism:
Homo sapiens (Human)
Description:
Q15722
Residue:
352
  
Inhibitor
Name:
BDBM50213057
Synonyms:
CHEMBL167520
Type:
Small organic molecule
Emp. Form.:
C23H29FN4O2
Mol. Mass.:
412.5004
SMILES:
CCc1cc(c(O)cc1OCCCCCC(C)(C)c1nn[nH]n1)-c1ccc(F)cc1
: