Target
Cannabinoid receptor 1/2
Ligand
BDBM50008029
Substrate
Meas. Tech.
ChEMBL_46140 (CHEMBL660013)
IC50
3155±n/a nM
Citation
  TBA Bioorg Med Chem Lett 6:17-22 (1996)   
Target
Name:
Cannabinoid receptor 1/2
Synonyms:
Cannabinoid receptor
Type:
Mol. Mass.:
Description:
ASSAY_ID of ChEMBL is 1859866
Components:
This complex has 2 components.
Component 1
Name:
Cannabinoid receptor 2
Synonyms:
CANNABINOID CB2 CB2 Cannabinoid CB2 receptor Cnr2 | rCB2
Type:
Enzyme
Mol. Mass.:
39366.68
Organism:
Rattus norvegicus (Rat)
Description:
Q9QZN9
Residue:
360
  
Component 2
Name:
Cannabinoid receptor 1
Synonyms:
Brain-type cannabinoid receptor CB-R CNR1_RAT Cannabinoid receptor Cnr1 | Skr6
Type:
G Protein-Coupled Receptor (GPCR)
Mol. Mass.:
52856.55
Organism:
Rattus norvegicus (rat)
Description:
P20272
Residue:
473
  
Inhibitor
Name:
BDBM50008029
Synonyms:
(4-Methoxy-phenyl)-[2-methyl-1-(2-morpholin-4-yl-ethyl)-1H-indol-3-yl]-methanone CHEMBL13178 | PRAVADOLINE
Type:
Small organic molecule
Emp. Form.:
C23H26N2O3
Mol. Mass.:
378.4641
SMILES:
COc1ccc(cc1)C(=O)c1c(C)n(CCN2CCOCC2)c2ccccc12
: