Target
D(2) dopamine receptor
Ligand
BDBM50213854
Substrate
Meas. Tech.
ChEBML_61648
Ki
<10000±n/a nM
Citation
  TBA Bioorg Med Chem Lett 6:1227-1232 (1996)   
Target
Name:
D(2) dopamine receptor
Synonyms:
D(2) dopamine receptor DOPAMINE D2 Long DRD2 Dopamine D2 receptor Dopamine D2 receptor (D2R) Dopamine2-like | d2
Type:
Cell-surface receptors
Mol. Mass.:
50647.10
Organism:
Homo sapiens (Human)
Description:
P14416
Residue:
443
  
Inhibitor
Name:
BDBM50213854
Synonyms:
CHEMBL20819
Type:
Small organic molecule
Emp. Form.:
C20H33N3O2
Mol. Mass.:
347.4949
SMILES:
COc1ccc(cc1)N1CCN(CCCCNC(=O)C(C)(C)C)CC1
: