Target
D(4) dopamine receptor
Ligand
BDBM50213849
Substrate
Meas. Tech.
ChEBML_61327
Ki
316±n/a nM
Citation
  TBA Bioorg Med Chem Lett 6:1227-1232 (1996)   
Target
Name:
D(4) dopamine receptor
Synonyms:
D(2C) dopamine receptor DOPAMINE D4.2 DRD4 Dopamine D4 receptor
Type:
Enzyme
Mol. Mass.:
48373.19
Organism:
Homo sapiens (Human)
Description:
P21917
Residue:
419
  
Inhibitor
Name:
BDBM50213849
Synonyms:
CHEMBL21035
Type:
Small organic molecule
Emp. Form.:
C19H31N3O
Mol. Mass.:
317.4689
SMILES:
CC(C)(C)C(=O)NCCCCN1CCN(CC1)c1ccccc1
: