Target
D(4) dopamine receptor
Ligand
BDBM50213862
Substrate
Meas. Tech.
ChEBML_61327
Ki
13±n/a nM
Citation
  TBA Bioorg Med Chem Lett 6:1227-1232 (1996)   
Target
Name:
D(4) dopamine receptor
Synonyms:
D(2C) dopamine receptor DOPAMINE D4.2 DRD4 Dopamine D4 receptor
Type:
Enzyme
Mol. Mass.:
48373.19
Organism:
Homo sapiens (Human)
Description:
P21917
Residue:
419
  
Inhibitor
Name:
BDBM50213862
Synonyms:
CHEMBL20444
Type:
Small organic molecule
Emp. Form.:
C21H34ClN3O
Mol. Mass.:
379.967
SMILES:
CCCC(C)(C)C(=O)NCCCCN1CCN(CC1)c1ccc(Cl)cc1
: