Target
D(2) dopamine receptor
Ligand
BDBM50213853
Substrate
Meas. Tech.
ChEMBL_61648 (CHEMBL670172)
Ki
2512±n/a nM
Citation
  TBA Bioorg Med Chem Lett 6:1227-1232 (1996)   
Target
Name:
D(2) dopamine receptor
Synonyms:
D(2) dopamine receptor DOPAMINE D2 Long DRD2 Dopamine D2 receptor Dopamine D2 receptor (D2R) Dopamine2-like | d2
Type:
Cell-surface receptors
Mol. Mass.:
50647.10
Organism:
Homo sapiens (Human)
Description:
P14416
Residue:
443
  
Inhibitor
Name:
BDBM50213853
Synonyms:
CHEMBL282008
Type:
Small organic molecule
Emp. Form.:
C17H26ClN3O
Mol. Mass.:
323.861
SMILES:
CC(C)(C)C(=O)NCCN1CCN(CC1)c1ccc(Cl)cc1
: