Target
D(4) dopamine receptor
Ligand
BDBM50213858
Substrate
Meas. Tech.
ChEMBL_61327 (CHEMBL670102)
Ki
158±n/a nM
Citation
  TBA Bioorg Med Chem Lett 6:1227-1232 (1996)   
Target
Name:
D(4) dopamine receptor
Synonyms:
D(2C) dopamine receptor DOPAMINE D4.2 DRD4 Dopamine D4 receptor
Type:
Enzyme
Mol. Mass.:
48373.19
Organism:
Homo sapiens (Human)
Description:
P21917
Residue:
419
  
Inhibitor
Name:
BDBM50213858
Synonyms:
CHEMBL21205
Type:
Small organic molecule
Emp. Form.:
C21H26ClN3O
Mol. Mass.:
371.904
SMILES:
Clc1ccc(cc1)N1CCN(CCCCNC(=O)c2ccccc2)CC1
: