Target
Type-1 angiotensin II receptor B
Ligand
BDBM50287293
Substrate
Meas. Tech.
ChEMBL_36487 (CHEMBL856951)
Ki
36±n/a nM
Citation
  TBA Bioorg Med Chem Lett 7:385-388 (1997)   
Target
Name:
Type-1 angiotensin II receptor B
Synonyms:
AGTRB_RAT Agtr1 Angiotensin II AT1B Angiotensin II type 1b (AT-1b) receptor Type-1B angiotensin II receptor
Type:
Enzyme Catalytic Domain
Mol. Mass.:
40929.44
Organism:
RAT
Description:
Angiotensin II AT1B 0 RAT::P29089
Residue:
359
  
Inhibitor
Name:
BDBM50287293
Synonyms:
CHEMBL286537 | N-[5-Ethyl-3-[2'-(1H-tetrazol-5-yl)-biphenyl-4-ylmethyl]-3H-[1,3,4]thiadiazol-(2Z)-ylidene]-benzamide
Type:
Small organic molecule
Emp. Form.:
C25H21N7OS
Mol. Mass.:
467.546
SMILES:
CCc1nn(Cc2ccc(cc2)-c2ccccc2-c2nnn[nH]2)c(=NC(=O)c2ccccc2)s1
: