Target
DNA gyrase subunit A/B
Ligand
BDBM50045004
Substrate
Meas. Tech.
ChEMBL_50467 (CHEMBL658170)
IC50
4980±n/a nM
Citation
 Weinder-Wells, MAAltom, JFernandez, JFraga-Spano, SAHilliard, JOhemeng, KBarrett, JF DNA gyrase inhibitory activity of ellagic acid derivatives. Bioorg Med Chem Lett 8:97-100 (1998)  
Target
Name:
DNA gyrase subunit A/B
Synonyms:
DNA Gyrase | DNA gyrase A/B
Type:
A2B2 tetramer
Mol. Mass.:
Description:
Components:
This complex has 2 components.
Component 1
Name:
DNA gyrase subunit A
Synonyms:
DNA gyrase GYRA_ECOLI hisW parD
Type:
Enzyme Subunit
Mol. Mass.:
96935.15
Organism:
Escherichia coli (strain K12)
Description:
Residue:
875
  
Component 2
Name:
DNA gyrase subunit B
Synonyms:
DNA gyrase subunit B GYRB_ECOLI acrB gyrB hisU parA | pcbA
Type:
Enzyme Subunit
Mol. Mass.:
89941.28
Organism:
Escherichia coli (strain K12)
Description:
P0AES6
Residue:
804
  
Inhibitor
Name:
BDBM50045004
Synonyms:
9-fluoro-3-methyl-10-(4-methylpiperazin-1-yl)-7-oxo-2,3-dihydro-7H-[1,4]oxazino[2,3,4-ij]quinoline-6-carboxylic acid OFLOXACIN | OFLX
Type:
Small organic molecule
Emp. Form.:
C18H20FN3O4
Mol. Mass.:
361.3675
SMILES:
CC1COc2c(N3CCN(C)CC3)c(F)cc3c2n1cc(C(O)=O)c3=O
: