Target
cGMP-inhibited 3',5'-cyclic phosphodiesterase 3A/3B
Ligand
BDBM50084033
Substrate
Meas. Tech.
ChEMBL_156460 (CHEMBL764838)
IC50
>100000±n/a nM
Citation
 Pascal, YAndrianjara, CRAuclair, EAvenel, NBertin, BCalvet, AFéru, FLardon, SMoodley, IOuagued, MPayne, APruniaux, MPSzilagyi, C Synthesis and structure-activity relationships of 4-oxo-1-phenyl-3,4,6,7-tetrahydro-[1,4]diazepino[6,7,1-hi]indoles: novel PDE4 inhibitors. Bioorg Med Chem Lett 10:35-8 (2000)  
Target
Name:
cGMP-inhibited 3',5'-cyclic phosphodiesterase 3A/3B
Synonyms:
Phosphodiesterase (PDE3) Phosphodiesterase 3 (PDE3) | cGMP-inhibited 3',5'-cyclic phosphodiesterase A/B
Type:
Mol. Mass.:
Description:
ASSAY_ID of ChEMBL is 156458
Components:
This complex has 2 components.
Component 1
Name:
cGMP-inhibited 3',5'-cyclic phosphodiesterase 3B
Synonyms:
CGI-PDE B CGIPDE1 PDE3B Phosphodiesterase 3B Phosphodiesterase Type 3 (PDE3B) cGMP-inhibited 3,5-cyclic phosphodiesterase B
Type:
Enzyme
Mol. Mass.:
124318.95
Organism:
Homo sapiens (Human)
Description:
PDE3B was generated from the full-length recombinant human clone transfected into Sf9 cells.
Residue:
1112
  
Component 2
Name:
cGMP-inhibited 3',5'-cyclic phosphodiesterase 3A
Synonyms:
3',5'-cyclic phosphodiesterase Cyclic GMP-inhibited phosphodiesterase A PDE3A_HUMAN Phosphodiesterase 3 (PDE3) Phosphodiesterase 3A Phosphodiesterase 3A (PDE3A1) cGMP-inhibited 3',5'-cyclic phosphodiesterase A | cGMP-inhibited 3,5-cyclic phosphodiesterase A
Type:
Enzyme
Mol. Mass.:
124966.46
Organism:
Homo sapiens (Human)
Description:
Q14432
Residue:
1141
  
Inhibitor
Name:
BDBM50084033
Synonyms:
1H-Indole-2-carboxylic acid [(R)-1-(2-fluoro-phenyl)-4-oxo-3,4,6,7-tetrahydro-[1,4]diazepino[6,7,1-hi]indol-3-yl]-amide FK480
Type:
Small organic molecule
Emp. Form.:
C26H19FN4O2
Mol. Mass.:
438.4531
SMILES:
Fc1ccccc1C1=N[C@@H](NC(=O)c2cc3ccccc3[nH]2)C(=O)N2CCc3cccc1c23
: