Target
cAMP-specific 3',5'-cyclic phosphodiesterase 4A/4B/4C/4D
Ligand
BDBM50218545
Substrate
Meas. Tech.
ChEMBL_192993 (CHEMBL803575)
IC50
10±n/a nM
Citation
 Crespo, MIGrŕcia, JPuig, CVega, ABou, JBeleta, JDoménech, TRyder, HSegarra, VPalacios, JM Synthesis and biological evaluation of 2,5-dihydropyrazol. Bioorg Med Chem Lett 10:2661-4 (2000)  
Target
Name:
cAMP-specific 3',5'-cyclic phosphodiesterase 4A/4B/4C/4D
Synonyms:
Phosphodiesterase 4
Type:
Mol. Mass.:
Description:
ASSAY_ID of ChEMBL is 193660
Components:
This complex has 4 components.
Component 1
Name:
cAMP-specific 3',5'-cyclic phosphodiesterase 4B
Synonyms:
DPDE4 Pde4b | Phosphodiesterase 4B
Type:
Enzyme Catalytic Domain
Mol. Mass.:
83349.50
Organism:
RAT
Description:
P14646
Residue:
736
  
Component 2
Name:
cAMP-specific 3',5'-cyclic phosphodiesterase 4D
Synonyms:
DPDE3 Pde4d
Type:
PROTEIN
Mol. Mass.:
90531.57
Organism:
Rattus norvegicus
Description:
ChEMBL_104732
Residue:
803
  
Component 3
Name:
cAMP-specific 3',5'-cyclic phosphodiesterase 4A
Synonyms:
DPDE2 Pde4a
Type:
PROTEIN
Mol. Mass.:
93412.58
Organism:
Rattus norvegicus
Description:
ChEMBL_104732
Residue:
844
  
Component 4
Name:
cAMP-specific 3',5'-cyclic phosphodiesterase 4C
Synonyms:
Dpde1 Pde4c
Type:
PROTEIN
Mol. Mass.:
60038.21
Organism:
Rattus norvegicus
Description:
ChEMBL_104732
Residue:
536
  
Inhibitor
Name:
BDBM50218545
Synonyms:
Nitraquazone
Type:
Small organic molecule
Emp. Form.:
C16H13N3O4
Mol. Mass.:
311.2921
SMILES:
CCn1c(=O)n(-c2cccc(c2)[N+]([O-])=O)c2ccccc2c1=O
: